BDBM177773 US10000475, Compound 2::US9120786, 2
SMILES NC(=O)c1nc(N[C@H]2CCNC2=O)nc(n1)-c1ccc(Oc2ccc(OC(F)(F)F)cc2)cc1
InChI Key InChIKey=NSFYQNROAOFSKV-HNNXBMFYSA-N
Data  2 IC50
  Tab Delimited (TSV)   2D SDfile   Computed 3D by Vconf -m prep SDfile
Find this compound or compounds like it in BindingDB:
Activity Spreadsheet -- Enzyme Inhibition Constant Data from BindingDB
Found 2 hits for monomerid = 177773
TargetSodium channel protein type 9 subunit alpha(Homo sapiens (Human))
Purdue Pharma
US Patent
LigandPNGBDBM177773(US10000475, Compound 2 | US9120786, 2)
Affinity DataIC50:  326nM. Assay description: The assay buffer was formulated by removing 120 mL from a 1 L bottle of fresh, sterile dH2O (Mediatech, Herndon, Va.) and adding 100 mL of 10×HBSS th...
Ligand InfoPC cidPC sid
In DepthDetails US Patent
TargetSodium channel protein type 9 subunit alpha(Homo sapiens (Human))
Purdue Pharma
US Patent
LigandPNGBDBM177773(US10000475, Compound 2 | US9120786, 2)
Affinity DataIC50:  326nMT: 2°C. Assay description: FLIPRTETRA Sodium Dye Assay with KCl: Cells were prepared by plating the recombinant HEK293 cells or other host cells expressing either recombinant o...
Ligand InfoPC cidPC sid
In DepthDetails US Patent