BDBM180919 US9676721, 109 3-chloro-5-[(4-{[2-cyano-3-(pyridin-4-yl)carbamimidamido]methyl}benzene)sulfonyl]-N,N-diethylbenzamide::US9676721, 54 2-cyano-1-({4-[(4-phenylbenzene)sulfonyl]phenyl}methyl)-3-(pyridin-4-yl)guanidine
SMILES O=S(=O)(c1ccc(CN\C(Nc2ccncc2)=N/C#N)cc1)c1ccc(cc1)-c1ccccc1
InChI Key InChIKey=SZBKBKCCPZPJGT-UHFFFAOYSA-N
Data  2 IC50
  Tab Delimited (TSV)   2D SDfile   Computed 3D by Vconf -m prep SDfile
Find this compound or compounds like it in BindingDB:
Activity Spreadsheet -- Enzyme Inhibition Constant Data from BindingDB
Found 2 hits for monomerid = 180919
TargetNicotinamide phosphoribosyltransferase(Homo sapiens (Human))
Forma Tm
US Patent
LigandPNGBDBM180919(US9676721, 109 3-chloro-5-[(4-{[2-cyano-3-(pyridin...)
Affinity DataIC50:  2.60nMpH: 7.5 T: 2°C. Assay description: The NAMPT enzymatic reactions were carried out in Buffer A (50 mM Hepes pH 7.5, 50 mM NaCl, 5 mM MgCl2, and 1 mM THP) in 96-well V-bottom plates. The...
Ligand InfoPC cidPC sid
In DepthDetails US Patent
TargetNicotinamide phosphoribosyltransferase(Homo sapiens (Human))
Forma Tm
US Patent
LigandPNGBDBM180919(US9676721, 109 3-chloro-5-[(4-{[2-cyano-3-(pyridin...)
Affinity DataIC50:  3.5nMpH: 7.5 T: 2°C. Assay description: The NAMPT enzymatic reactions were carried out in Buffer A (50 mM Hepes pH 7.5, 50 mM NaCl, 5 mM MgCl2, and 1 mM THP) in 96-well V-bottom plates. The...
Ligand InfoPC cidPC sid
In DepthDetails US Patent