BDBM183062 US9150544, 96
SMILES Nc1nccc2cc(C[C@@H](N3CC[C@H](NS(=O)(=O)c4cnc(s4)N4CCCC4)C3=O)C(O)=O)c(OC(F)(F)F)cc12
InChI Key InChIKey=ONHZVHMZTKZTFT-DLBZAZTESA-N
Data  2 IC50
  Tab Delimited (TSV)   2D SDfile   Computed 3D by Vconf -m prep SDfile
Find this compound or compounds like it in BindingDB:
Activity Spreadsheet -- Enzyme Inhibition Constant Data from BindingDB
Found 2 hits for monomerid = 183062
TargetCoagulation factor X(Homo sapiens (Human))
Sanofi
US Patent
LigandPNGBDBM183062(US9150544, 96)
Affinity DataIC50:  42nMpH: 7.0Assay Description:The compounds according to the invention are tested in a range of concentrations (10pM to 10 µM final) in assay buffer (50 mM TRIS, 100 mM NaCl, 0.1 ...
In DepthDetails US Patent
TargetCoagulation factor IX(Homo sapiens (Human))
Sanofi
US Patent
LigandPNGBDBM183062(US9150544, 96)
Affinity DataIC50:  83nM. Assay description: The compounds according to the invention are tested in a range of concentrations (4.9 nM to 5 µM final) and deposited in a proportion of 25 µl per we...
In DepthDetails US Patent