BDBM18433 4-methyl-N-[4-methyl-2-(4-methylpiperidin-1-yl)quinolin-6-yl]cyclohexane-1-carboxamide::Aminoquinoline compound, 18
SMILES CC1CCC(CC1)C(=O)Nc1ccc2nc(cc(C)c2c1)N1CCC(C)CC1
InChI Key InChIKey=LPXVCPVAKUZWGD-UHFFFAOYSA-N
Data  1 KI  1 IC50
  Tab Delimited (TSV)   2D SDfile   Computed 3D by Vconf -m prep SDfile
Find this compound or compounds like it in BindingDB:
Activity Spreadsheet -- Enzyme Inhibition Constant Data from BindingDB
Found 1 hit for monomerid = 18433
TargetLysosomal acid glucosylceramidase(Homo sapiens (Human))
Nih
LigandPNGBDBM18433(4-methyl-N-[4-methyl-2-(4-methylpiperidin-1-yl)qui...)
Affinity DataKi:  120nM ΔG°:  -9.31kcal/mole IC50:  268nMpH: 5.9 T: 2°C. Assay description: Enzyme activity was determined as the production of fluorescent resorufin from the substrate. The fluorescence was measured (excitation 570 nm, emiss...
In DepthDetails ArticlePubMed