BDBM185867 US9163007, 218
SMILES Clc1ccccc1S(=O)(=O)Nc1n[nH]c2ccc(cc12)-c1nnn(Cc2ccccc2)c1C1CC1
InChI Key InChIKey=MWLKDAKDYYDVBZ-UHFFFAOYSA-N
Data  1 KI
  Tab Delimited (TSV)   2D SDfile   Computed 3D by Vconf -m prep SDfile
Find this compound or compounds like it in BindingDB:
Activity Spreadsheet -- Enzyme Inhibition Constant Data from BindingDB
Found 1 hit for monomerid = 185867
TargetCell division cycle 7-related protein kinase(Homo sapiens (Human))
Abbvie
US Patent
LigandPNGBDBM185867(US9163007, 218)
Affinity DataKi: >1.23E+3nMpH: 7.5Assay Description:11 data point. Cdc7 kinase assays were carried out in 25 mM HEPES, pH 7.5, 1 mM DTT, 10 mM MgCl2, 100 μM Na3VO4, and 0.075 mg/ml Triton X-100 u...
In DepthDetails US Patent