BDBM186109 US9670142, A145 6-(7-fluoro-2,3-dihydro-1H-indol-5-yl)-N-methyl-N-((1R,3S)-3-propionylamino-cyclopentyl)-nicotinamide
SMILES CCC(=O)N[C@H]1CC[C@H](C1)N(C)C(=O)c1ccc(nc1)-c1cc2CCNc2c(F)c1
InChI Key InChIKey=AHNAJHZZCLEHMM-ZWKOTPCHSA-N
Data  1 IC50
  Tab Delimited (TSV)   2D SDfile   Computed 3D by Vconf -m prep SDfile
Find this compound or compounds like it in BindingDB:
Activity Spreadsheet -- Enzyme Inhibition Constant Data from BindingDB
Found 1 hit for monomerid = 186109
TargetFatty acid synthase(Homo sapiens (Human))
Merck Patent
US Patent
LigandPNGBDBM186109(US9670142, A145 6-(7-fluoro-2,3-dihydro-1H-indol-5...)
Affinity DataIC50:  1.75E+3nMpH: 7.0 T: 2°C. Assay description: The biochemical FASN activity testing was performed as 384 well two-time-point kinetic fluorescence intensity assay format in Greiner low volume medi...
Ligand InfoPC cidPC sid
In DepthDetails US Patent