BDBM18706 6-(2-methoxyphenyl)-2,2-dimethyl-4-[(propylsulfanyl)methyl]-1,2-dihydroquinoline::dihydroquinoline compound, 17
SMILES CCCSCC1=CC(C)(C)Nc2ccc(cc12)-c1ccccc1OC
InChI Key InChIKey=OTAVWHYNRBBEDJ-UHFFFAOYSA-N
Data  2 IC50
  Tab Delimited (TSV)   2D SDfile   Computed 3D by Vconf -m prep SDfile
Find this compound or compounds like it in BindingDB:
Activity Spreadsheet -- Enzyme Inhibition Constant Data from BindingDB
Found 2 hits for monomerid = 18706
TargetProgesterone receptor(Homo sapiens (Human))
Boehringer Ingelheim Pharmaceuticals
LigandPNGBDBM18706(6-(2-methoxyphenyl)-2,2-dimethyl-4-[(propylsulfany...)
Affinity DataIC50:  1.60E+3nM. Assay description: IC50 values shown are means of a single experiment done in duplicate 11-point concentration-effect curves.
In DepthDetails ArticlePubMed
TargetGlucocorticoid receptor(Homo sapiens (Human))
Boehringer Ingelheim Pharmaceuticals
LigandPNGBDBM18706(6-(2-methoxyphenyl)-2,2-dimethyl-4-[(propylsulfany...)
Affinity DataIC50:  1.02E+3nMpH: 7.4 T: 2°C. Assay description: IC50 values shown are means of a single experiment done in duplicate 11-point concentration-effect curves.
In DepthDetails ArticlePubMed