BDBM187166 US9670181, 46 4-((6-ethoxy-2-(ethylamino)quinolin-3-yl)methyl)-1-isopropyl-6,7-dimethoxyisoquinolin-3-ol
SMILES CCNc1nc2ccc(OCC)cc2cc1Cc1c(O)nc(C(C)C)c2cc(OC)c(OC)cc12
InChI Key InChIKey=YSULUHPMOZYEET-UHFFFAOYSA-N
Data  1 IC50
  Tab Delimited (TSV)   2D SDfile   Computed 3D by Vconf -m prep SDfile
Find this compound or compounds like it in BindingDB:
Activity Spreadsheet -- Enzyme Inhibition Constant Data from BindingDB
Found 1 hit for monomerid = 187166
TargetcAMP and cAMP-inhibited cGMP 3',5'-cyclic phosphodiesterase 10A(Homo sapiens (Human))
Allergan
US Patent
LigandPNGBDBM187166(US9670181, 46 4-((6-ethoxy-2-(ethylamino)quinolin-...)
Affinity DataIC50:  29nMpH: 7.4 T: 2°C. Assay description: The PDE assay is based on the homogenous time-resolved fluorescence resonance energy transfer (TR-FRET) technology (LANCE® from Perkin Elmer). This c...
Ligand InfoPC cidPC sid
In DepthDetails US Patent