BDBM187521 US9670191, F16
SMILES NC(=O)c1cc([nH]c1-c1cccc(F)c1F)-c1ccnc(N)n1
InChI Key InChIKey=ZRSJFDMHGQGNQC-UHFFFAOYSA-N
Data  1 IC50
  Tab Delimited (TSV)   2D SDfile   Computed 3D by Vconf -m prep SDfile
Find this compound or compounds like it in BindingDB:
Activity Spreadsheet -- Enzyme Inhibition Constant Data from BindingDB
Found 1 hit for monomerid = 187521
TargetCell division cycle 7-related protein kinase [58-574]/Protein DBF4 homolog A(Homo sapiens (Human))
Nerviano Medical Sciences
US Patent
LigandPNGBDBM187521(US9670191, F16)
Affinity DataIC50: <1.00E+3nM. Assay description: The assay consists of the transfer of radioactivity labeled phosphate moiety by the kinase to an acceptor substrate. The resulting 33P-labeled produc...
Ligand InfoPC cidPC sid
In DepthDetails US Patent