BDBM188257 US9073941, 539
SMILES CCc1ccc(NC(=O)C2CCN(CC2)S(=O)(=O)c2cn(CC)cn2)cc1
InChI Key InChIKey=REJDJEGYHPVHEV-UHFFFAOYSA-N
Data  1 IC50
  Tab Delimited (TSV)   2D SDfile   Computed 3D by Vconf -m prep SDfile
Find this compound or compounds like it in BindingDB:
Activity Spreadsheet -- Enzyme Inhibition Constant Data from BindingDB
Found 1 hit for monomerid = 188257
TargetDihydrolipoyl dehydrogenase(Mycobacterium tuberculosis)
Academia Sinica
US Patent
LigandPNGBDBM188257(US9073941, 539)
Affinity DataIC50:  4.30E+3nMpH: 7.0Assay Description:The assay was performed in a manner similar to that described in Bryk et al., Biochemistry (2010) 49:1616-1627 and modified for an online robotics sc...
In DepthDetails US Patent