BDBM191984 US9187430, 61::US9718787, 61
SMILES CCC(CC)C(=O)N1CCN(CC1)C(=O)c1cc(Oc2n[nH]c(=O)c3ccccc23)ccc1F
InChI Key InChIKey=IJSAVXZCXLCXRP-UHFFFAOYSA-N
Data  2 IC50
  Tab Delimited (TSV)   2D SDfile   Computed 3D by Vconf -m prep SDfile
Find this compound or compounds like it in BindingDB:
Activity Spreadsheet -- Enzyme Inhibition Constant Data from BindingDB
Found 2 hits for monomerid = 191984
TargetPoly [ADP-ribose] polymerase 1(Homo sapiens (Human))
Chengdu Diao Pharmaceutical Group
US Patent
LigandPNGBDBM191984(US9187430, 61 | US9718787, 61)
Affinity DataIC50:  8nMT: 2°C. Assay description: The kit is based on ELISA. 10 μl sample/well, 15 μl PARP enzyme/well and PARP cocktail 25 μl/well with a total volume of 50 μl/we...
In DepthDetails US Patent
TargetPoly [ADP-ribose] polymerase 1(Homo sapiens (Human))
Chengdu Diao Pharmaceutical Group
US Patent
LigandPNGBDBM191984(US9187430, 61 | US9718787, 61)
Affinity DataIC50:  8nMT: 2°C. Assay description: PARP-1 can catalyze the NAD-dependent addition of poly (ADP-ribose) to adjacent nuclear proteins such as histone. The activity of PARP was determined...
In DepthDetails US Patent