BDBM192782 US9187487, 12
SMILES CCN1C(=O)S\C(=C\c2ccc(Nc3cnc4[nH]cc(C(=O)C(C)(C)C)c4n3)cc2)C1=O
InChI Key InChIKey=WWWYKSFVWVMVJA-MHWRWJLKSA-N
Data  1 IC50
  Tab Delimited (TSV)   2D SDfile   Computed 3D by Vconf -m prep SDfile
Find this compound or compounds like it in BindingDB:
Activity Spreadsheet -- Enzyme Inhibition Constant Data from BindingDB
Found 1 hit for monomerid = 192782
TargetTyrosine-protein kinase JAK3 [781-1124](Homo sapiens (Human))
Principia Biopharma
US Patent
LigandPNGBDBM192782(US9187487, 12)
Affinity DataIC50:  280nMpH: 7.5 T: 2°C. Assay description: Phosphorylation of the appropriate peptide substrate (fluorescently labeled Srctide) by recombinant JAK3 (catalytic domain, aa 781-1124) was measured...
In DepthDetails US Patent