BDBM192824 US9187487, 97
SMILES CN(C)C(=O)C(=Cc1cccc(c1)-c1cnc2[nH]cc(C(=O)C(C)(C)C)c2n1)C#N
InChI Key InChIKey=MOHNSLATPQQJJZ-MHWRWJLKSA-N
Data  1 IC50
  Tab Delimited (TSV)   2D SDfile   Computed 3D by Vconf -m prep SDfile
Find this compound or compounds like it in BindingDB:
Activity Spreadsheet -- Enzyme Inhibition Constant Data from BindingDB
Found 1 hit for monomerid = 192824
TargetTyrosine-protein kinase JAK3 [781-1124](Homo sapiens (Human))
Principia Biopharma
US Patent
LigandPNGBDBM192824(US9187487, 97)
Affinity DataIC50:  104nMpH: 7.5 T: 2°C. Assay description: Phosphorylation of the appropriate peptide substrate (fluorescently labeled Srctide) by recombinant JAK3 (catalytic domain, aa 781-1124) was measured...
In DepthDetails US Patent