BDBM194388 US9200016, 70::US9902710, Compound 70
SMILES CCCCc1ncc(Cc2cnc3cc(C)ccc3c2)c2cc(OC)c(OC)cc12
InChI Key InChIKey=BCUBWAWHYGUJFH-UHFFFAOYSA-N
Data  2 IC50
  Tab Delimited (TSV)   2D SDfile   Computed 3D by Vconf -m prep SDfile
Find this compound or compounds like it in BindingDB:
Activity Spreadsheet -- Enzyme Inhibition Constant Data from BindingDB
Found 2 hits for monomerid = 194388
TargetcAMP and cAMP-inhibited cGMP 3',5'-cyclic phosphodiesterase 10A(Homo sapiens (Human))
Exonhit Therapeutics
US Patent
LigandPNGBDBM194388(US9200016, 70 | US9902710, Compound 70)
Affinity DataIC50:  946nM. Assay description: The phosphodiesterase assay was developed using the LANCE® cAMP kit (PerkinElmer). The assay buffer contained HBSS with 5 mM HEPES, 0.1% BSA, and 1.5...
In DepthDetails US Patent
TargetcAMP and cAMP-inhibited cGMP 3',5'-cyclic phosphodiesterase 10A(Homo sapiens (Human))
Exonhit Therapeutics
US Patent
LigandPNGBDBM194388(US9200016, 70 | US9902710, Compound 70)
Affinity DataIC50:  946nMpH: 7.4 T: 2°C. Assay description: The phosphodiesterase assay was developed using the LANCE cAMP kit (PerkinElmer). The assay buffer contained HBSS with 5 mM HEPES, 0.1% BSA, and 1....
In DepthDetails US Patent