BDBM195222 US9212153, 288,Ex. 238
SMILES CC(C)N1C(N)=NC2(C1=O)c1cc(ccc1CC21CCC(CC1)OC(F)F)-c1cncc(F)c1
InChI Key InChIKey=AQSJGWGIUVUFFB-UHFFFAOYSA-N
Data  1 IC50
  Tab Delimited (TSV)   2D SDfile   Computed 3D by Vconf -m prep SDfile
Find this compound or compounds like it in BindingDB:
Activity Spreadsheet -- Enzyme Inhibition Constant Data from BindingDB
Found 1 hit for monomerid = 195222
TargetBeta-secretase 1 [1-458](Homo sapiens (Human))
Vitae Pharmaceuticals
US Patent
LigandPNGBDBM195222(US9212153, 288,Ex. 238)
Affinity DataIC50:  14.8nMpH: 4.4Assay Description:For each compound being tested, the BACE activity was monitored in a fluorescence quenching assay (FRET) using the ectodomain of BACE (aa 1-454) fuse...
Ligand InfoPC cidPC sid
In DepthDetails US Patent