BDBM195818 US9670212, 170 9-{[8-methyl-2-(2-methylpyrrolidin-1-yl)quinolin-3-yl]methyl}-9H-purin-6-amine
SMILES CC1CCCN1c1nc2c(C)cccc2cc1Cn1cnc2c(N)ncnc12
InChI Key InChIKey=ZDRLXBHUYYPKPZ-UHFFFAOYSA-N
Data  1 IC50
  Tab Delimited (TSV)   2D SDfile   Computed 3D by Vconf -m prep SDfile
Find this compound or compounds like it in BindingDB:
Activity Spreadsheet -- Enzyme Inhibition Constant Data from BindingDB
Found 1 hit for monomerid = 195818
LigandPNGBDBM195818(US9670212, 170 9-{[8-methyl-2-(2-methylpyrrolidin-...)
Affinity DataIC50:  150nM. Assay description: Kinase activity is measured as the percent of ATP consumed following the kinase reaction using luciferase-luciferin-coupled chemiluminescence. Reacti...
Ligand InfoPC cidPC sid
In DepthDetails US Patent