BDBM198234 US9216999, 42::US9556187, Example 42
SMILES FC(F)(F)c1ccc(CCN2CCC(CC2)c2nnn3cnc4[nH]ccc4c23)cc1
InChI Key InChIKey=NIGMZMFZEBEOSJ-UHFFFAOYSA-N
Data  9 IC50
  Tab Delimited (TSV)   2D SDfile   Computed 3D by Vconf -m prep SDfile
Find this compound or compounds like it in BindingDB:
Activity Spreadsheet -- Enzyme Inhibition Constant Data from BindingDB
Found 9 hits for monomerid = 198234
TargetTyrosine-protein kinase JAK2(Homo sapiens (Human))
Nissan Chemical Industries
US Patent
LigandPNGBDBM198234(US9216999, 42 | US9556187, Example 42)
Affinity DataIC50:  410nMpH: 7.5Assay Description:JAK1, JAK2, JAK3 and Tyk2 were purchased from Carna Biosciences, Inc. As the substrate, LANCE Ultra ULight-JAK1 Peptide (manufactured by PerkinElmer ...
Ligand InfoPC cidPC sid
In DepthDetails US Patent
TargetTyrosine-protein kinase JAK3(Homo sapiens (Human))
Nissan Chemical Industries
US Patent
LigandPNGBDBM198234(US9216999, 42 | US9556187, Example 42)
Affinity DataIC50: >1.00E+3nMpH: 7.5Assay Description:JAK1, JAK2, JAK3 and Tyk2 were purchased from Carna Biosciences, Inc. As the substrate, LANCE Ultra ULight-JAK1 Peptide (manufactured by PerkinElmer ...
Ligand InfoPC cidPC sid
In DepthDetails US Patent
TargetNon-receptor tyrosine-protein kinase TYK2(Homo sapiens (Human))
Nissan Chemical Industries
US Patent
LigandPNGBDBM198234(US9216999, 42 | US9556187, Example 42)
Affinity DataIC50: >1.00E+3nMpH: 7.5Assay Description:JAK1, JAK2, JAK3 and Tyk2 were purchased from Carna Biosciences, Inc. As the substrate, LANCE Ultra ULight-JAK1 Peptide (manufactured by PerkinElmer ...
Ligand InfoPC cidPC sid
In DepthDetails US Patent
TargetTyrosine-protein kinase JAK1(Homo sapiens (Human))
Nissan Chemical Industries
US Patent
LigandPNGBDBM198234(US9216999, 42 | US9556187, Example 42)
Affinity DataIC50:  82nMpH: 7.5Assay Description:JAK1, JAK2, JAK3 and Tyk2 were purchased from Carna Biosciences, Inc. As the substrate, LANCE Ultra ULight-JAK1 Peptide (manufactured by PerkinElmer ...
Ligand InfoPC cidPC sid
In DepthDetails US Patent
TargetTyrosine-protein kinase JAK3(Homo sapiens (Human))
Nissan Chemical Industries
US Patent
LigandPNGBDBM198234(US9216999, 42 | US9556187, Example 42)
Affinity DataIC50:  93nMT: 2°C. Assay description: JAK1, JAK2, JAK3 and Tyk2 were purchased from Carna Biosciences, Inc. As the substrate, LANCE Ultra ULight-JAK1 Peptide (manufactured by PerkinElmer ...
Ligand InfoPC cidPC sid
In DepthDetails US Patent
TargetTyrosine-protein kinase JAK2(Homo sapiens (Human))
Nissan Chemical Industries
US Patent
LigandPNGBDBM198234(US9216999, 42 | US9556187, Example 42)
Affinity DataIC50:  410nMT: 2°C. Assay description: JAK1, JAK2, JAK3 and Tyk2 were purchased from Carna Biosciences, Inc. As the substrate, LANCE Ultra ULight-JAK1 Peptide (manufactured by PerkinElmer ...
Ligand InfoPC cidPC sid
In DepthDetails US Patent
TargetTyrosine-protein kinase JAK1(Homo sapiens (Human))
Nissan Chemical Industries
US Patent
LigandPNGBDBM198234(US9216999, 42 | US9556187, Example 42)
Affinity DataIC50:  16nMT: 2°C. Assay description: JAK1, JAK2, JAK3 and Tyk2 were purchased from Carna Biosciences, Inc. As the substrate, LANCE Ultra ULight-JAK1 Peptide (manufactured by PerkinElmer ...
Ligand InfoPC cidPC sid
In DepthDetails US Patent
TargetTyrosine-protein kinase JAK2(Homo sapiens (Human))
Nissan Chemical Industries
US Patent
LigandPNGBDBM198234(US9216999, 42 | US9556187, Example 42)
Affinity DataIC50:  150nMT: 2°C. Assay description: JAK1, JAK2, JAK3 and Tyk2 were purchased from Carna Biosciences, Inc. As the substrate, LANCE Ultra ULight-JAK1 Peptide (manufactured by PerkinElmer ...
Ligand InfoPC cidPC sid
In DepthDetails US Patent
TargetTyrosine-protein kinase JAK1(Homo sapiens (Human))
Nissan Chemical Industries
US Patent
LigandPNGBDBM198234(US9216999, 42 | US9556187, Example 42)
Affinity DataIC50:  82nMT: 2°C. Assay description: JAK1, JAK2, JAK3 and Tyk2 were purchased from Carna Biosciences, Inc. As the substrate, LANCE Ultra ULight-JAK1 Peptide (manufactured by PerkinElmer ...
Ligand InfoPC cidPC sid
In DepthDetails US Patent