BDBM200449 US10011599, Example 78::US9227969, 78::US9629836, 78
SMILES Cc1nc2cnc3cc(F)c(cc3c2n1C1CCN(CC1)C(=O)CO)-c1ccc(Oc2nccc(C)n2)cc1
InChI Key InChIKey=ADBKOQIERJLCFF-UHFFFAOYSA-N
Data  3 IC50
  Tab Delimited (TSV)   2D SDfile   Computed 3D by Vconf -m prep SDfile
Find this compound or compounds like it in BindingDB:
Activity Spreadsheet -- Enzyme Inhibition Constant Data from BindingDB
Found 3 hits for monomerid = 200449
LigandPNGBDBM200449(US10011599, Example 78 | US9227969, 78 | US9629836...)
Affinity DataIC50:  179nMpH: 7.5Assay Description:A BRAF-MEK-ERK cascade assay is used to evaluate the effects of these compounds as inhibitors of the MAP kinase pathway. An enzymatic cascade assay i...
Ligand InfoPC cidPC sid
In DepthDetails US Patent
TargetDual specificity mitogen-activated protein kinase kinase 1(Homo sapiens (Human))
Novartis
US Patent
LigandPNGBDBM200449(US10011599, Example 78 | US9227969, 78 | US9629836...)
Affinity DataIC50:  179nM. Assay description: [MEK1 1mM ATP IC50 uM] A BRAF-MEK-ERK cascade assay is used to evaluate the effects of these compounds as inhibitors of the MAP kinase pathway. An en...
Ligand InfoPC cidPC sid
In DepthDetails US Patent
TargetDual specificity mitogen-activated protein kinase kinase 1 [K97R](Homo sapiens (Human))
Novartis
US Patent
LigandPNGBDBM200449(US10011599, Example 78 | US9227969, 78 | US9629836...)
Affinity DataIC50:  179nM. Assay description: The radioactive filter binding assay is standardized using recombinant human activated BRAF (V599E) kinase (Cat No. 14-557) and kinase dead MEK1 (K97...
Ligand InfoPC cidPC sid
In DepthDetails US Patent