BDBM202281 US9238619, 35
SMILES Cn1cnc(c1)S(=O)(=O)NCCOc1cccc(c1)C(CN1CCCC1)Cc1ccccc1
InChI Key InChIKey=ADWQNYPZFCWFJT-UHFFFAOYSA-N
Data  1 KI
  Tab Delimited (TSV)   2D SDfile   Computed 3D by Vconf -m prep SDfile
Find this compound or compounds like it in BindingDB:
Activity Spreadsheet -- Enzyme Inhibition Constant Data from BindingDB
Found 1 hit for monomerid = 202281
TargetSodium- and chloride-dependent glycine transporter 1(Homo sapiens (Human))
Abbvie Deutschland
US Patent
LigandPNGBDBM202281(US9238619, 35)
Affinity DataKi: <1nM. Assay description: Radioligand binding to human GlyT1c transporter-expressing membranes was determined as described in Mezler et al., Molecular Pharmacology 74:1705-171...
Ligand InfoPC cidPC sid
In DepthDetails US Patent