BDBM203860 2-(2-Bromo-3,4,5-trimethoxy-benzylidene)-7-nitro-tetralone (3ag)
SMILES COc1cc(\C=C2/CCc3ccc(cc3C2=O)[N+]([O-])=O)c(Br)c(OC)c1OC
InChI Key InChIKey=GQLWSNPLJUTFOM-XYOKQWHBSA-N
Data  4 IC50
  Tab Delimited (TSV)   2D SDfile   Computed 3D by Vconf -m prep SDfile
Find this compound or compounds like it in BindingDB:
Activity Spreadsheet -- Enzyme Inhibition Constant Data from BindingDB
Found 4 hits for monomerid = 203860
TargetAcetylcholinesterase(Electrophorus electricus (Electric eel))
Wuhan University of Technology
LigandPNGBDBM203860(2-(2-Bromo-3,4,5-trimethoxy-benzylidene)-7-nitro-t...)
Affinity DataIC50:  570nMpH: 8.0 T: 2°C. Assay description: This spectrophotometric assay is based on the reaction of 5,5-dithio-bis(2-nitrobenzoic)acid (DTNB) with thiocholine to yield a colored product. Sh...
Ligand InfoPC cidPC sid
In DepthDetails ArticlePubMed
TargetAmine oxidase [flavin-containing] B(Rattus norvegicus (rat))
Wuhan University of Technology
LigandPNGBDBM203860(2-(2-Bromo-3,4,5-trimethoxy-benzylidene)-7-nitro-t...)
Affinity DataIC50:  910nMpH: 7.4 T: 2°C. Assay description: A fluorimetric method reported by Matsumoto et al.[T. Matsumoto, O. Suzuki, T. Furuta, M. Asai, Y. Kurokawa, Y. Nimura, Y. Katsumata, I. Takahashi. C...
Ligand InfoPC cidPC sid
In DepthDetails ArticlePubMed
TargetAmine oxidase [flavin-containing] A(Rattus norvegicus (rat))
Wuhan University of Technology
LigandPNGBDBM203860(2-(2-Bromo-3,4,5-trimethoxy-benzylidene)-7-nitro-t...)
Affinity DataIC50:  990nMpH: 7.4 T: 2°C. Assay description: A fluorimetric method reported by Matsumoto et al.[T. Matsumoto, O. Suzuki, T. Furuta, M. Asai, Y. Kurokawa, Y. Nimura, Y. Katsumata, I. Takahashi. C...
Ligand InfoPC cidPC sid
In DepthDetails ArticlePubMed
TargetCarboxylic ester hydrolase(Equus caballus (Horse))
Wuhan University of Technology
LigandPNGBDBM203860(2-(2-Bromo-3,4,5-trimethoxy-benzylidene)-7-nitro-t...)
Affinity DataIC50:  6.20E+3nMpH: 8.0 T: 2°C. Assay description: This spectrophotometric assay is based on the reaction of 5,5-dithio-bis(2-nitrobenzoic)acid (DTNB) with thiocholine to yield a colored product. Sh...
Ligand InfoPC cidPC sid
In DepthDetails ArticlePubMed