BDBM212497 US10155731, Example 55::US9278944, 55
SMILES COCCCOc1cc(cc2OCCc12)[C@@H](C)N(C1CC1)C(=O)[C@H]1CNCCO1
InChI Key InChIKey=WJQKCWNAKUURRT-QVKFZJNVSA-N
Data  2 IC50
  Tab Delimited (TSV)   2D SDfile   Computed 3D by Vconf -m prep SDfile
Find this compound or compounds like it in BindingDB:
Activity Spreadsheet -- Enzyme Inhibition Constant Data from BindingDB
Found 2 hits for monomerid = 212497
TargetRenin(Homo sapiens (Human))
Mitsubishi Tanabe Pharma
US Patent
LigandPNGBDBM212497(US10155731, Example 55 | US9278944, 55)
Affinity DataIC50:  1.90nM. Assay description: A substrate of synthetic peptide (Nma-KHPFH LVIHK(Dnp)-NH2) and test compound were mixed, and fluorescence intensity was assayed using a fluorophotom...
Ligand InfoPC cidPC sid
In DepthDetails US Patent
TargetRenin(Homo sapiens (Human))
Mitsubishi Tanabe Pharma
US Patent
LigandPNGBDBM212497(US10155731, Example 55 | US9278944, 55)
Affinity DataIC50:  1.90nM. Assay description: A substrate of synthetic peptide (Nma-KHPFHLVIHK(Dnp)-NH2) and test compound were mixed, and fluorescence intensity was assayed using a fluorophotome...
Ligand InfoPC cidPC sid
In DepthDetails US Patent