BDBM212977 US9278960, 4-61::US9636337, 4-61
SMILES C[C@@H]1CN(Cc2ccc3c(cc(nc3c2)C(N)=O)-c2cnn(C)c2)CCO1
InChI Key InChIKey=SHBZCBBTFHWIIY-CYBMUJFWSA-N
Data  3 IC50
  Tab Delimited (TSV)   2D SDfile   Computed 3D by Vconf -m prep SDfile
Find this compound or compounds like it in BindingDB:
Activity Spreadsheet -- Enzyme Inhibition Constant Data from BindingDB
Found 3 hits for monomerid = 212977
LigandPNGBDBM212977(US9278960, 4-61 | US9636337, 4-61)
Affinity DataIC50:  166nM. Assay description: The utility of the compounds in accordance with the present invention as antagonists of metabotropic glutamate receptor activity, in particular mGluR...
Ligand InfoPC cidPC sid
In DepthDetails US Patent
TargetMetabotropic glutamate receptor 2(Homo sapiens (Human))
Merck Sharp & Dohme
US Patent
LigandPNGBDBM212977(US9278960, 4-61 | US9636337, 4-61)
Affinity DataIC50:  166nM. Assay description: The utility of the compounds in accordance with the present invention as antagonists of metabotropic glutamate receptor activity, in particular mGluR...
Ligand InfoPC cidPC sid
In DepthDetails US Patent
TargetMetabotropic glutamate receptor 2(Homo sapiens (Human))
Merck Sharp & Dohme
US Patent
LigandPNGBDBM212977(US9278960, 4-61 | US9636337, 4-61)
Affinity DataIC50:  166nM. Assay description: The utility of the compounds in accordance with the present invention as antagonists of metabotropic glutamate receptor activity, in particular mGluR...
Ligand InfoPC cidPC sid
In DepthDetails US Patent