BDBM214872 US9296734, 73
SMILES C[C@]1(C[C@H](OC(N)=N1)C(F)(F)F)c1cc(NC(=O)c2cnc(OCC#C)cn2)cnc1F
InChI Key InChIKey=FZAKIPOCIJPZTE-UGSOOPFHSA-N
Data  3 IC50
  Tab Delimited (TSV)   2D SDfile   Computed 3D by Vconf -m prep SDfile
Find this compound or compounds like it in BindingDB:
Activity Spreadsheet -- Enzyme Inhibition Constant Data from BindingDB
Found 3 hits for monomerid = 214872
TargetCathepsin D(Homo sapiens (Human))
Amgen
US Patent
LigandPNGBDBM214872(US9296734, 73)
Affinity DataIC50:  1.69E+6nMpH: 3.5Assay Description:Recombinant Cat D was expressed in CHO cells. The assay buffer for CathepsinD is 0.05 M citrate pH 3.5, 10% DMSO final, 5 mM CHAPS. The Cat D enzyme ...
Ligand InfoPC cidPC sid
In DepthDetails US Patent
TargetBeta-secretase 1(Homo sapiens (Human))
Amgen
US Patent
LigandPNGBDBM214872(US9296734, 73)
Affinity DataIC50:  4.70nMpH: 4.2Assay Description:The assay buffer used in this screen is 0.05 M acetate, pH 4.2, 10% DMSO final, 100 uM genapol (which is a nonionic detergent, below its Critical Mic...
Ligand InfoPC cidPC sid
In DepthDetails US Patent
TargetBeta-secretase 1(Homo sapiens (Human))
Amgen
US Patent
LigandPNGBDBM214872(US9296734, 73)
Affinity DataIC50:  2.5nMT: 2°C. Assay description: The cell-based assay measures inhibition or reduction of Aβ40 in conditioned medium of test compound treated cells expressing amyloid precursor ...
Ligand InfoPC cidPC sid
In DepthDetails US Patent