BDBM217078 US9302989, 370
SMILES CC(C)CCNC(=O)c1ccc(NC(=O)N2Cc3ccccc3C2)nc1
InChI Key InChIKey=PDBGOBDVQXENFX-UHFFFAOYSA-N
Data  1 KI  1 IC50
  Tab Delimited (TSV)   2D SDfile   Computed 3D by Vconf -m prep SDfile
Find this compound or compounds like it in BindingDB:
Activity Spreadsheet -- Enzyme Inhibition Constant Data from BindingDB
Found 2 hits for monomerid = 217078
TargetNicotinamide phosphoribosyltransferase(Homo sapiens (Human))
Abbvie
Curated by ChEMBL
LigandPNGBDBM217078(US9302989, 370)
Affinity DataKi:  5.40nM. Assay description: Inhibition of C-terminal His-tagged human recombinant NAMPT using FK866 or isoindoline urea-based Oregon green (488) probe incubated for 3 hrs by TR-...
Ligand InfoPC cidPC sid
In DepthDetails ArticlePubMed
TargetNicotinamide phosphoribosyltransferase(Homo sapiens (Human))
Abbvie
Curated by ChEMBL
LigandPNGBDBM217078(US9302989, 370)
Affinity DataIC50:  7.5nMpH: 7.5Assay Description:Probe 1:The assay was carried out in 18 uL low volume plates (Owens Corning) in reaction buffer (50 mM HEPES (NaOH), pH 7.5, 100 mM NaCl, 10 mM MgCl2...
Ligand InfoPC cidPC sid
In DepthDetails US Patent