BDBM222146 2-methyl-2-(2-methylpropyl)-2,3-dihydroquinazolin-4(1H)-one (3g)
SMILES CC(C)CC1(C)NC(=O)c2ccccc2N1
InChI Key InChIKey=GLTLSRADCWBWDK-UHFFFAOYSA-N
Data  2 IC50
  Tab Delimited (TSV)   2D SDfile   Computed 3D by Vconf -m prep SDfile
Find this compound or compounds like it in BindingDB:
Activity Spreadsheet -- Enzyme Inhibition Constant Data from BindingDB
Found 2 hits for monomerid = 222146
TargetCarboxylic ester hydrolase(Equus caballus (Horse))
University of Sargodha
LigandPNGBDBM222146(2-methyl-2-(2-methylpropyl)-2,3-dihydroquinazolin-...)
Affinity DataIC50:  1.79E+4nMpH: 8.0Assay Description:Galantamine was used as reference drugs. The synthesized quinazolines were dissolved in 0.1 M phosphate buffer of pH 8.0. (KH2PO4/K2HPO4. The reactio...
In DepthDetails ArticlePubMed
TargetAcetylcholinesterase(Electrophorus electricus (Electric eel))
University of Sargodha
LigandPNGBDBM222146(2-methyl-2-(2-methylpropyl)-2,3-dihydroquinazolin-...)
Affinity DataIC50:  3.10E+4nMpH: 8.0Assay Description:Galantamine was used as reference drugs. The synthesized quinazolines were dissolved in 0.1 M phosphate buffer of pH 8.0. (KH2PO4/K2HPO4. The reactio...
In DepthDetails ArticlePubMed