BDBM223375 US9315520, 90::US9605007, Example 90::US9744173, Example 90
SMILES COCc1nc(co1)C(=O)Nc1csc(n1)[C@]12CO[C@@H](C)C[C@H]1CSC(N)=N2
InChI Key InChIKey=ZYIJHQUUGUPTRV-YMNVWFMLSA-N
Data  3 IC50
  Tab Delimited (TSV)   2D SDfile   Computed 3D by Vconf -m prep SDfile
Find this compound or compounds like it in BindingDB:
Activity Spreadsheet -- Enzyme Inhibition Constant Data from BindingDB
Found 3 hits for monomerid = 223375
TargetIsoform D of Beta-secretase 1 (BACE-I-432)(Homo sapiens (Human))
Pfizer
US Patent
LigandPNGBDBM223375(US9315520, 90 | US9605007, Example 90 | US9744173,...)
Affinity DataIC50:  175nMpH: 4.5 T: 2°C. Assay description: The substrate is Biotin-GLTNIKTEEISEISY^EVEFR-C[Oregon Green]KK-OH. The BACE1 enzyme is affinity purified material from conditioned media of CHO-K1 c...
Ligand InfoPC cidPC sid
In DepthDetails US Patent
TargetBeta-secretase 1(Homo sapiens (Human))
Pfizer
US Patent
LigandPNGBDBM223375(US9315520, 90 | US9605007, Example 90 | US9744173,...)
Affinity DataIC50:  175nM. Assay description: Beta-secretase (BACE) is one of the enzymes involved in the generation of the amyloid beta peptide found in the amyloid plaques of Alzheimer's Di...
Ligand InfoPC cidPC sid
In DepthDetails US Patent
TargetBeta-secretase 1(Homo sapiens (Human))
Pfizer
US Patent
LigandPNGBDBM223375(US9315520, 90 | US9605007, Example 90 | US9744173,...)
Affinity DataIC50:  175nM. Assay description: Beta-secretase (BACE) is one of the enzymes involved in the generation of the amyloid beta peptide found in the amyloid plaques of Alzheimer's Di...
Ligand InfoPC cidPC sid
In DepthDetails US Patent