BDBM226124 1-Ethyl-2-methyl-2-phenyl-2,3-dihydro-1H-quinazolin-4-one (2e)
SMILES CCN1c2ccccc2C(=O)NC1(C)c1ccccc1
InChI Key InChIKey=QBQKEUORPAFNFP-UHFFFAOYSA-N
Data  2 IC50
  Tab Delimited (TSV)   2D SDfile   Computed 3D by Vconf -m prep SDfile
Find this compound or compounds like it in BindingDB:
Activity Spreadsheet -- Enzyme Inhibition Constant Data from BindingDB
Found 2 hits for monomerid = 226124
TargetCarboxylic ester hydrolase(Equus caballus (Horse))
University of Sargodha
LigandPNGBDBM226124(1-Ethyl-2-methyl-2-phenyl-2,3-dihydro-1H-quinazoli...)
Affinity DataIC50:  6.14E+4nMpH: 8.0 T: 2°C. Assay description: AChE and BChE inhibitory assay was carried out by following Ellman's methodology [Ellman et al., Biochem. Pharmacol., 7:88-95] using AChE (Electric e...
Ligand InfoPC cidPC sid
In DepthDetails
TargetAcetylcholinesterase(Electrophorus electricus (Electric eel))
University of Sargodha
LigandPNGBDBM226124(1-Ethyl-2-methyl-2-phenyl-2,3-dihydro-1H-quinazoli...)
Affinity DataIC50:  1.86E+4nMpH: 8.0 T: 2°C. Assay description: AChE and BChE inhibitory assay was carried out by following Ellman's methodology [Ellman et al., Biochem. Pharmacol., 7:88-95] using AChE (Electric e...
Ligand InfoPC cidPC sid
In DepthDetails