BDBM228854 US9333195, 74::US9687478, 74
SMILES OC(C(=O)O[C@H]1C[N+]2(CCCn3cccc3)CCC1CC2)(c1cccs1)c1cccs1
InChI Key InChIKey=CTHSROQQKRDVOW-VJLZTBLDSA-N
Data  2 IC50
  Tab Delimited (TSV)   2D SDfile   Computed 3D by Vconf -m prep SDfile
Find this compound or compounds like it in BindingDB:
Activity Spreadsheet -- Enzyme Inhibition Constant Data from BindingDB
Found 2 hits for monomerid = 228854
TargetMuscarinic acetylcholine receptor M3(Homo sapiens (Human))
Almirall
US Patent
LigandPNGBDBM228854(US9333195, 74 | US9687478, 74)
Affinity DataIC50:  16nMT: 2°C. Assay description: Assays were carried out at 25° C. Membrane preparations from stably transfected chinese hamster ovary-K1 cells (CHO) expressing the genes for the...
Ligand InfoPC cidPC sid
In DepthDetails US Patent
TargetMuscarinic acetylcholine receptor M3(Homo sapiens (Human))
Almirall
US Patent
LigandPNGBDBM228854(US9333195, 74 | US9687478, 74)
Affinity DataIC50:  16nM. Assay description: The binding of [3H]-NMS to human muscarinic receptors was performed according to Waelbroek et al (1990) (1). Assays were carried out at 25° C. Membra...
Ligand InfoPC cidPC sid
In DepthDetails US Patent