BDBM230451 US9340510, 1.055
SMILES COc1c(OCC2CCC2)ccc2CN(Cc3ccc(cc3)[C@H](C)NC(=O)C3CC3)CCc12
InChI Key InChIKey=HJMCDZFZIVUJFZ-IBGZPJMESA-N
Data  1 IC50
  Tab Delimited (TSV)   2D SDfile   Computed 3D by Vconf -m prep SDfile
Find this compound or compounds like it in BindingDB:
Activity Spreadsheet -- Enzyme Inhibition Constant Data from BindingDB
Found 1 hit for monomerid = 230451
TargetAcetyl-CoA carboxylase 2(Homo sapiens (Human))
Boehringer Ingelheim International
US Patent
LigandPNGBDBM230451(US9340510, 1.055)
Affinity DataIC50:  41nMpH: 7.5Assay Description:Assay reactions are then carried out in 384-well plates, with hACC2 in an appropriate dilution and at final assay concentrations (f.c.) of 100 mM Tri...
Ligand InfoPC cidPC sid
In DepthDetails US Patent