BDBM234652 US9353101, 48
SMILES COc1ncc(cc1-c1cnc(nc1CN1[C@@H](C)[C@H](OC1=O)c1cc(F)cc(c1)C(F)(F)F)N1CC(F)C1)-c1c(C)cc(cc1C)C(O)=O
InChI Key InChIKey=KXMVISWIQUPPEC-YRVHBCJASA-N
Data  1 IC50
  Tab Delimited (TSV)   2D SDfile   Computed 3D by Vconf -m prep SDfile
Find this compound or compounds like it in BindingDB:
Activity Spreadsheet -- Enzyme Inhibition Constant Data from BindingDB
Found 1 hit for monomerid = 234652
TargetCholesteryl ester transfer protein(Homo sapiens (Human))
Merck Sharp & Dohme
US Patent
LigandPNGBDBM234652(US9353101, 48)
Affinity DataIC50:  15nMpH: 7.4 T: 2°C. Assay description: Radiolabeled donor particles are generated by first combining 100 μl of 200 μM butylated hydroxyl toluene in CHCl3, 216 μL of 21.57 mM DOPC ...
Ligand InfoPC cidPC sid
In DepthDetails US Patent