BDBM235922 US9365511, 18
SMILES C[C@H](NC(=O)CCc1ccc(cc1)-c1ccc(CCN2CCC[C@H]2C)cc1)C(O)=O
InChI Key InChIKey=ZHYVTSLVFAXKHU-MOPGFXCFSA-N
Data  1 IC50
  Tab Delimited (TSV)   2D SDfile   Computed 3D by Vconf -m prep SDfile
Find this compound or compounds like it in BindingDB:
Activity Spreadsheet -- Enzyme Inhibition Constant Data from BindingDB
Found 1 hit for monomerid = 235922
TargetHistamine H3 receptor(Homo sapiens (Human))
Arena Pharmaceuticals
US Patent
LigandPNGBDBM235922(US9365511, 18)
Affinity DataIC50:  0.790nM. Assay description: Compounds of the present invention were evaluated using the human H3 receptor (H3R) HTRF cAMP assay. In this assay, HEK293 cells expressing the human...
Ligand InfoPC cidPC sid
In DepthDetails US Patent