BDBM236202 US9365563, V5::US9878991, Compound V5
SMILES Cc1cc(NC(=O)N2CCC(F)(CC2)c2ncc(cc2Cl)[C@@H](O)CO)ccc1OC(F)(F)F
InChI Key InChIKey=LKNKSKQCNAUQET-INIZCTEOSA-N
Data  4 IC50
  Tab Delimited (TSV)   2D SDfile   Computed 3D by Vconf -m prep SDfile
Find this compound or compounds like it in BindingDB:
Activity Spreadsheet -- Enzyme Inhibition Constant Data from BindingDB
Found 4 hits for monomerid = 236202
TargetTransient receptor potential cation channel subfamily V member 1(Homo sapiens (Human))
Purdue Pharma
US Patent
LigandPNGBDBM236202(US9365563, V5 | US9878991, Compound V5)
Affinity DataIC50:  45.5nMpH: 7.4Assay Description:Two days prior to performing this assay, cells are seeded in poly-D-lysine-coated 96-well clear-bottom black plates (50,000 cells/well) in growth med...
Ligand InfoPC cidPC sid
In DepthDetails US Patent
TargetTransient receptor potential cation channel subfamily V member 1(Homo sapiens (Human))
Purdue Pharma
US Patent
LigandPNGBDBM236202(US9365563, V5 | US9878991, Compound V5)
Affinity DataIC50:  10.1nMpH: 7.4Assay Description:Two days prior to performing this assay, cells are seeded on poly-D-lysine-coated 96-well clear-bottom black plates (commercially available from Bect...
Ligand InfoPC cidPC sid
In DepthDetails US Patent
TargetTransient receptor potential cation channel subfamily V member 1(Homo sapiens (Human))
Purdue Pharma
US Patent
LigandPNGBDBM236202(US9365563, V5 | US9878991, Compound V5)
Affinity DataIC50:  45.5nMpH: 7.4Assay Description:Two days prior to performing this assay, cells are seeded in poly-D-lysine-coated 96-well clear-bottom black plates (50,000 cells/well) in growth med...
Ligand InfoPC cidPC sid
In DepthDetails US Patent
TargetTransient receptor potential cation channel subfamily V member 1(Homo sapiens (Human))
Purdue Pharma
US Patent
LigandPNGBDBM236202(US9365563, V5 | US9878991, Compound V5)
Affinity DataIC50:  10.1nMpH: 7.4Assay Description:Two days prior to performing this assay, cells are seeded on poly-D-lysine-coated 96-well clear-bottom black plates (commercially available from Bect...
Ligand InfoPC cidPC sid
In DepthDetails US Patent