BDBM236639 US9388139, 6
SMILES CC(C)(C)C1=NN(C(C1)c1ccc(Cl)cc1)c1cccc(c1)C(O)=O
InChI Key InChIKey=PGDFBIBSGWKCGX-UHFFFAOYSA-N
Data  3 IC50
  Tab Delimited (TSV)   2D SDfile   Computed 3D by Vconf -m prep SDfile
Find this compound or compounds like it in BindingDB:
Activity Spreadsheet -- Enzyme Inhibition Constant Data from BindingDB
Found 3 hits for monomerid = 236639
TargetcGMP-specific 3',5'-cyclic phosphodiesterase(Homo sapiens (Human))
German University
US Patent
LigandPNGBDBM236639(US9388139, 6)
Affinity DataIC50:  9.90E+3nM. Assay description: PDE activity was measured using the IMAP fluorescence polarization assay (Molecular Devices) in which binding of hydrolyzed cyclic nucleotide substra...
Ligand InfoPC cidPC sid
In DepthDetails US Patent
TargetProstaglandin G/H synthase 2(Homo sapiens (Human))
German University
US Patent
LigandPNGBDBM236639(US9388139, 6)
Affinity DataIC50: >1.00E+5nM. Assay description: The activities of COX-1 and COX-2 were measured after the addition of arachidonic acid and incubation at 25° C. for 5 min by absorbance at 590 nm as ...
Ligand InfoPC cidPC sid
In DepthDetails US Patent
TargetProstaglandin G/H synthase 1(Homo sapiens (Human))
German University
US Patent
LigandPNGBDBM236639(US9388139, 6)
Affinity DataIC50: >1.00E+5nM. Assay description: The activities of COX-1 and COX-2 were measured after the addition of arachidonic acid and incubation at 25° C. for 5 min by absorbance at 590 nm as ...
Ligand InfoPC cidPC sid
In DepthDetails US Patent