BDBM238203 US9402837, 7
SMILES Cc1ccccc1CN1C[C@@H](O)[C@H](O)[C@@H](CO)C1
InChI Key InChIKey=FBYMXLLBYHENBK-MGPQQGTHSA-N
Data  1 KI  1 IC50
  Tab Delimited (TSV)   2D SDfile   Computed 3D by Vconf -m prep SDfile
Find this compound or compounds like it in BindingDB:
Activity Spreadsheet -- Enzyme Inhibition Constant Data from BindingDB
Found 1 hit for monomerid = 238203
TargetLysosomal acid glucosylceramidase(Homo sapiens (Human))
Amicus Therapeutics
US Patent
LigandPNGBDBM238203(US9402837, 7)
Affinity DataKi:  2.88E+4nM IC50:  6.95E+4nMpH: 4.5Assay Description:To 2.5 μl of supernatant (in 96-well plates) was added 17.5 μl reaction buffer (citrate phosphate buffer, pH 4.5, no Triton X-100), and 50 μ...
Ligand InfoPC cidPC sid
In DepthDetails US Patent