BDBM238991 US9403846, 7
SMILES CC1(CC1)[C@H]1C[C@H]2CSC(N)=N[C@]2(CO1)c1ccc(F)cc1F
InChI Key InChIKey=JWGPPHJPNLTEEM-IXBGWNDUSA-N
Data  1 IC50
  Tab Delimited (TSV)   2D SDfile   Computed 3D by Vconf -m prep SDfile
Find this compound or compounds like it in BindingDB:
Activity Spreadsheet -- Enzyme Inhibition Constant Data from BindingDB
Found 1 hit for monomerid = 238991
TargetBeta-secretase 1(Homo sapiens (Human))
Pfizer
US Patent
LigandPNGBDBM238991(US9403846, 7)
Affinity DataIC50:  484nMpH: 4.5Assay Description:A synthetic APP substrate that can be cleaved by beta-secretase having N-terminal biotin and made fluorescent by the covalent attachment of Oregon Gr...
Ligand InfoPC cidPC sid
In DepthDetails US Patent