BDBM241353 US10479788, Example 197::US11046688, Example 197::US9409907, 197
SMILES COC(C)(C)CNc1nc(C)cc2cnc(Nc3ccc(cc3OC(F)F)-c3cnn(C)c3)nc12
InChI Key InChIKey=XVWBYYWZQXVZLG-UHFFFAOYSA-N
Data  2 IC50
  Tab Delimited (TSV)   2D SDfile   Computed 3D by Vconf -m prep SDfile
Find this compound or compounds like it in BindingDB:
Activity Spreadsheet -- Enzyme Inhibition Constant Data from BindingDB
Found 2 hits for monomerid = 241353
TargetDual specificity protein kinase TTK(Homo sapiens (Human))
Cancer Research Technology
US Patent
LigandPNGBDBM241353(US10479788, Example 197 | US11046688, Example 197 ...)
Affinity DataIC50:  34nM. Assay description: The enzyme reaction (total volume 10 μl) was carried out in black 384-well low volume plates containing full length MPS1 (12.5 nM or 3 nM), fluo...
Ligand InfoPC cidPC sid
In DepthDetails US Patent
TargetDual specificity protein kinase TTK(Homo sapiens (Human))
Cancer Research Technology
US Patent
LigandPNGBDBM241353(US10479788, Example 197 | US11046688, Example 197 ...)
Affinity DataIC50:  34nMpH: 7.0 T: 2°C. Assay description: The enzyme reaction (total volume 10 μl) was carried out in black 384-well low volume plates containing full length MPS1 (12.5 nM or 3 nM), fluo...
Ligand InfoPC cidPC sid
In DepthDetails US Patent