BDBM242493 US9422235, 74
SMILES CC(C)(NS(=O)(=O)c1ccc(NC2CC3CCC2C3)cc1C(F)(F)F)C1CC1
InChI Key InChIKey=XIMWVTODMNEYPM-UHFFFAOYSA-N
Data  3 KI  3 IC50
  Tab Delimited (TSV)   2D SDfile   Computed 3D by Vconf -m prep SDfile
Find this compound or compounds like it in BindingDB:
Activity Spreadsheet -- Enzyme Inhibition Constant Data from BindingDB
Found 3 hits for monomerid = 242493
TargetCannabinoid receptor 2(Homo sapiens (Human))
Pharmos
US Patent
LigandPNGBDBM242493(US9422235, 74)
Affinity DataKi:  69.2nM ΔG°:  -9.92kcal/mole IC50:  153nMT: 2°C. Assay description: The binding assays were performed by testing the ability of the new compounds to displace the radiolabeled synthetic non-selective cannabinoid agonis...
Ligand InfoPC cidPC sid
In DepthDetails US Patent
TargetCannabinoid receptor 1(Homo sapiens (Human))
Pharmos
US Patent
LigandPNGBDBM242493(US9422235, 74)
Affinity DataKi:  273nM ΔG°:  -9.10kcal/mole IC50:  569nMT: 2°C. Assay description: The binding assays were performed by testing the ability of the new compounds to displace the radiolabeled synthetic non-selective cannabinoid agonis...
Ligand InfoPC cidPC sid
In DepthDetails US Patent
TargetCannabinoid receptor 1(Homo sapiens (Human))
Pharmos
US Patent
LigandPNGBDBM242493(US9422235, 74)
Affinity DataKi:  4.91E+3nM ΔG°:  -7.36kcal/mole IC50:  8.81E+3nMT: 2°C. Assay description: The binding assays were performed by testing the ability of the new compounds to displace the radiolabeled synthetic non-selective cannabinoid agonis...
Ligand InfoPC cidPC sid
In DepthDetails US Patent