BDBM242569 US9422240, 1-385
SMILES Cc1ccc(Oc2cnc(CN3CCC(O)=C(C(=O)NCC(O)=O)C3=O)cn2)cc1
InChI Key InChIKey=HIJVYCOTSHPXAU-UHFFFAOYSA-N
Data  1 IC50
  Tab Delimited (TSV)   2D SDfile   Computed 3D by Vconf -m prep SDfile
Find this compound or compounds like it in BindingDB:
Activity Spreadsheet -- Enzyme Inhibition Constant Data from BindingDB
Found 1 hit for monomerid = 242569
TargetEgl nine homolog 1(Homo sapiens (Human))
Taisho Pharmaceutical
US Patent
LigandPNGBDBM242569(US9422240, 1-385)
Affinity DataIC50:  54nMpH: 7.5Assay Description:The enzyme and the substrate were each diluted with a 50 mM tris-hydrochloric acid buffer (pH 7.5) containing 12.5 mM KCl, 3.75 mM MgCl2, 25 μM ...
Ligand InfoPC cidPC sid
In DepthDetails US Patent