BDBM24542 3-{2-[(3Z)-5-{[(3-chlorophenyl)methyl]sulfamoyl}-2-oxo-2,3-dihydro-1H-indol-3-ylidene]hydrazin-1-yl}benzoic acid::Oxindole scaffold, 10g
SMILES OC(=O)c1cccc(NN=C2C(=O)Nc3ccc(cc23)S(=O)(=O)NCc2cccc(Cl)c2)c1
InChI Key InChIKey=VWMZDCPNRXSTKQ-UHFFFAOYSA-N
Data  3 IC50
  Tab Delimited (TSV)   2D SDfile   Computed 3D by Vconf -m prep SDfile
Find this compound or compounds like it in BindingDB:
Activity Spreadsheet -- Enzyme Inhibition Constant Data from BindingDB
Found 3 hits for monomerid = 24542
TargetTyrosine-protein phosphatase non-receptor type 11 [205-593](Homo sapiens (Human))
Moffitt Cancer Center
LigandPNGBDBM24542(3-{2-[(3Z)-5-{[(3-chlorophenyl)methyl]sulfamoyl}-2...)
Affinity DataIC50:  3.80E+3nMpH: 7.0 T: 2°C. Assay description: PTP activity was measured in a black 96-well plate. Reaction was initiated by addition of the substrate DiFMUP to enzyme mixtures containing test com...
In DepthDetails ArticlePubMed
TargetTyrosine-protein phosphatase non-receptor type 1(Homo sapiens (Human))
Moffitt Cancer Center
LigandPNGBDBM24542(3-{2-[(3Z)-5-{[(3-chlorophenyl)methyl]sulfamoyl}-2...)
Affinity DataIC50:  1.54E+4nM. Assay description: PTP activity was measured in a black 96-well plate. Reaction was initiated by addition of the substrate DiFMUP to enzyme mixtures containing test com...
In DepthDetails ArticlePubMed
TargetTyrosine-protein phosphatase non-receptor type 6 [205-595](Homo sapiens (Human))
Moffitt Cancer Center
LigandPNGBDBM24542(3-{2-[(3Z)-5-{[(3-chlorophenyl)methyl]sulfamoyl}-2...)
Affinity DataIC50:  4.25E+4nM. Assay description: PTP activity was measured in a black 96-well plate. Reaction was initiated by addition of the substrate DiFMUP to enzyme mixtures containing test com...
In DepthDetails ArticlePubMed