BDBM249246 US9458140, 3
SMILES CC1(C)OC(=C(C1=O)c1cccc(NS(=O)(=O)c2c(F)cccc2F)c1F)c1ccnc(NCCC#N)n1
InChI Key InChIKey=JCTVTVGJAKMVBL-UHFFFAOYSA-N
Data  1 IC50
  Tab Delimited (TSV)   2D SDfile   Computed 3D by Vconf -m prep SDfile
Find this compound or compounds like it in BindingDB:
Activity Spreadsheet -- Enzyme Inhibition Constant Data from BindingDB
Found 1 hit for monomerid = 249246
TargetSerine/threonine-protein kinase B-raf [V600E](Homo sapiens (Human))
Eternity Bioscience
US Patent
LigandPNGBDBM249246(US9458140, 3)
Affinity DataIC50:  13nMpH: 7.5 T: 2°C. Assay description: The BRAFV600E enzymatic assay was performed using a LanthaScreen kinase assay kit purchased from Life Technologies (Grand Island, N.Y.). The assay wa...
Ligand InfoPC cidPC sid
In DepthDetails US Patent