BDBM254833 US9487554, 20
SMILES CC(C)(CNC(=O)c1ccc2[C@H]3CC[C@@]4(C)[C@@H](CC=C4c4cncnc4)[C@@H]3CCc2c1)C(O)=O
InChI Key InChIKey=MBPITEHMWPEJGQ-YNTKSTAESA-N
Data  2 IC50
  Tab Delimited (TSV)   2D SDfile   Computed 3D by Vconf -m prep SDfile
Find this compound or compounds like it in BindingDB:
Activity Spreadsheet -- Enzyme Inhibition Constant Data from BindingDB
Found 2 hits for monomerid = 254833
TargetAldo-keto reductase family 1 member C3/Glutathione S-transferase P(Homo sapiens (Human))
Bayer Intellectual Property
US Patent
LigandPNGBDBM254833(US9487554, 20)
Affinity DataIC50:  46.3nMpH: 7.0Assay Description:Essentially, the enzyme activity is measured by quantification of the Coumberol from Coumberone (Halim, M., Yee, D. J., and Sames, D., J. AM. CHEM. S...
Ligand InfoPC cidPC sid
In DepthDetails US Patent
TargetAldo-keto reductase family 1 member C3/Glutathione S-transferase P(Homo sapiens (Human))
Bayer Intellectual Property
US Patent
LigandPNGBDBM254833(US9487554, 20)
Affinity DataIC50:  45.5nMpH: 7.0Assay Description:Essentially, the enzyme activity is measured by quantification of the Coumberol from Coumberone (Halim, M., Yee, D. J., and Sames, D., J. AM. CHEM. S...
Ligand InfoPC cidPC sid
In DepthDetails US Patent