BDBM255083 US9475817, 40
SMILES Cn1cc(c(n1)-c1ccc(F)cc1)-c1ccc2nc(NC(=O)C3CCOCC3)cn2n1
InChI Key InChIKey=OVVDOOKBJRZOAR-UHFFFAOYSA-N
Data  2 IC50
  Tab Delimited (TSV)   2D SDfile   Computed 3D by Vconf -m prep SDfile
Find this compound or compounds like it in BindingDB:
Activity Spreadsheet -- Enzyme Inhibition Constant Data from BindingDB
Found 2 hits for monomerid = 255083
TargetCasein kinase I isoform delta(Homo sapiens (Human))
Bristol-Myers Squibb
US Patent
LigandPNGBDBM255083(US9475817, 40)
Affinity DataIC50:  5.40nMpH: 7.4 T: 2°C. Assay description: The kinase assay was performed in V-bottom 384-well plates. The final assay volume was 30 ul prepared from 15 ul additions of enzyme, substrates (flu...
Ligand InfoPC cidPC sid
In DepthDetails US Patent
TargetCasein kinase I isoform epsilon(Homo sapiens (Human))
Bristol-Myers Squibb
US Patent
LigandPNGBDBM255083(US9475817, 40)
Affinity DataIC50:  18nMpH: 7.4 T: 2°C. Assay description: The kinase assay was performed in V-bottom 384-well plates. The final assay volume was 30 ul prepared from 15 ul additions of enzyme, substrates (flu...
Ligand InfoPC cidPC sid
In DepthDetails US Patent