BDBM256440 US9487501, 41
SMILES Clc1nccnc1-n1cc(cn1)C(=O)Nc1ccc(cc1)[C@H]1CNCCO1
InChI Key InChIKey=PXBPFPZGGXTBED-OAHLLOKOSA-N
Data  2 KI
  Tab Delimited (TSV)   2D SDfile   Computed 3D by Vconf -m prep SDfile
Find this compound or compounds like it in BindingDB:
Activity Spreadsheet -- Enzyme Inhibition Constant Data from BindingDB
Found 2 hits for monomerid = 256440
TargetTrace amine-associated receptor 1(Mus musculus (Mouse))
Hoffmann-La Roche
US Patent
LigandPNGBDBM256440(US9487501, 41)
Affinity DataKi:  27.5nM ΔG°:  -10.7kcal/molepH: 7.4 T: 2°C. Assay description: HEK-293 cells stably expressing mouse TAAR1 were maintained at 37° C. and 5% CO2 in DMEM high glucose medium, containing fetal calf serum (10%, h...
Ligand InfoPC cidPC sid
In DepthDetails US Patent
TargetTrace amine-associated receptor 1(Rattus norvegicus (Rat))
Hoffmann-La Roche
US Patent
LigandPNGBDBM256440(US9487501, 41)
Affinity DataKi:  81.4nM ΔG°:  -10.1kcal/molepH: 7.4 T: 2°C. Assay description: HEK-293 cells stably expressing rat TAAR1 were maintained at 37° C. and 5% CO2 in DMEM high glucose medium, containing fetal calf serum (10%, hea...
Ligand InfoPC cidPC sid
In DepthDetails US Patent