BDBM258294 US9493485, 9-135
SMILES COc1cnc(cn1)C(=O)Nc1ccc(F)c(c1)[C@]1(C)CC2(CCC2)OC(N)=N1
InChI Key InChIKey=RCMAWWVBBZRVDN-IBGZPJMESA-N
Data  3 IC50
  Tab Delimited (TSV)   2D SDfile   Computed 3D by Vconf -m prep SDfile
Find this compound or compounds like it in BindingDB:
Activity Spreadsheet -- Enzyme Inhibition Constant Data from BindingDB
Found 3 hits for monomerid = 258294
TargetBeta-secretase 1(Homo sapiens (Human))
Imago Pharmaceuticals
US Patent
LigandPNGBDBM258294(US9493485, 9-135)
Affinity DataIC50:  10.5nMpH: 7.0Assay Description:BACE1 activity can be assessed in an AlphaScreenŽ assay. Compounds to be assessed (e.g. compounds as described in the above examples) are serially di...
Ligand InfoPC cidPC sid
In DepthDetails US Patent
TargetCathepsin D(Homo sapiens (Human))
Imago Pharmaceuticals
US Patent
LigandPNGBDBM258294(US9493485, 9-135)
Affinity DataIC50: >3.00E+4nMpH: 4.5 T: 2°C. Assay description: Compounds are also assessed for BACE1 and Cathepsin D activity using an FP Assay. Compounds to be assessed (e.g. compounds as described in the above ...
Ligand InfoPC cidPC sid
In DepthDetails US Patent
TargetBeta-secretase 1(Homo sapiens (Human))
Imago Pharmaceuticals
US Patent
LigandPNGBDBM258294(US9493485, 9-135)
Affinity DataIC50:  281nMpH: 4.5 T: 2°C. Assay description: Compounds are also assessed for BACE1 and Cathepsin D activity using an FP Assay. Compounds to be assessed (e.g. compounds as described in the above ...
Ligand InfoPC cidPC sid
In DepthDetails US Patent