BDBM260050 US9522881, 7'c-2 (L95N79)
SMILES Cn1c(c(I)c2cc(C(O)=O)c(O)cc12)-c1ccc(cc1)C(=O)NCc1ccc2OCOc2c1
InChI Key InChIKey=QUKGAQXEIUNDIF-UHFFFAOYSA-N
Data  1 IC50
  Tab Delimited (TSV)   2D SDfile   Computed 3D by Vconf -m prep SDfile
Find this compound or compounds like it in BindingDB:
Activity Spreadsheet -- Enzyme Inhibition Constant Data from BindingDB
Found 1 hit for monomerid = 260050
TargetPhosphatidylinositol 3,4,5-trisphosphate 5-phosphatase 2(Homo sapiens (Human))
Indiana University Research and Technology
US Patent
LigandPNGBDBM260050(US9522881, 7'c-2 (L95N79))
Affinity DataIC50:  4.20E+3nMpH: 7.0Assay Description:The inhibition assays were performed at 25° C. in 50 mM 3,3-dimethylglutarate buffer, pH 7.0, containing 1 mM EDTA with an ionic strength of 0.15M ad...
Ligand InfoPC cidPC sid
In DepthDetails US Patent