BDBM260401 US9527838, 29
SMILES CCOC(=O)Cc1nc(NC(=O)c2nc(Sc3ccc(F)cc3)ccc2Sc2ccc(F)cc2)sc1Cl
InChI Key InChIKey=NYXJMRXWBSVRLW-UHFFFAOYSA-N
Data  1 EC50
  Tab Delimited (TSV)   2D SDfile   Computed 3D by Vconf -m prep SDfile
Find this compound or compounds like it in BindingDB:
Activity Spreadsheet -- Enzyme Inhibition Constant Data from BindingDB
Found 1 hit for monomerid = 260401
TargetHexokinase-4(Homo sapiens (Human))
Merck Sharp & Dohme
US Patent
LigandPNGBDBM260401(US9527838, 29)
Affinity DataEC50:  1.60E+4nM. Assay description: Recombinant human liver glucokinase was expressed as a FLAG fusion protein in E. coli, and purified on ANTIFLAG M2 AFFINITY GEL (Sigma). The assay wa...
Ligand InfoPC cidPC sid
In DepthDetails US Patent