BDBM261577 US9708270, 72
SMILES COc1cc(C)cc(c1)N1CCC2(CCC(CC(O)=O)CC2)CC1
InChI Key InChIKey=KYTUXCPGNASKSF-UHFFFAOYSA-N
Data  1 EC50
  Tab Delimited (TSV)   2D SDfile   Computed 3D by Vconf -m prep SDfile
Find this compound or compounds like it in BindingDB:
Activity Spreadsheet -- Enzyme Inhibition Constant Data from BindingDB
Found 1 hit for monomerid = 261577
TargetFree fatty acid receptor 4(Homo sapiens (Human))
Merck Sharp & Dohme
US Patent
LigandPNGBDBM261577(US9708270, 72)
Affinity DataEC50:  3.06E+3nM. Assay description: On the day before the measurement day, CHO cells expressing human GPR120 were plated at 10000 cells per well in a 384-well black plate (#3702, Cornin...
Ligand InfoPC cidPC sid
In DepthDetails US Patent