BDBM263110 US9708359, 35
SMILES Cc1ncc2c(cn([C@@H]3O[C@H](CO)[C@@H](O)[C@H]3O)c2n1)C(N)=O
InChI Key InChIKey=ZAKGQTZEHXTZMC-VWMGYNLJSA-N
Data  1 EC50
  Tab Delimited (TSV)   2D SDfile   Computed 3D by Vconf -m prep SDfile
Find this compound or compounds like it in BindingDB:
Activity Spreadsheet -- Enzyme Inhibition Constant Data from BindingDB
Found 1 hit for monomerid = 263110
TargetGenome polyprotein(Murine norovirus 1)
Chimerix
US Patent
LigandPNGBDBM263110(US9708359, 35)
Affinity DataEC50: >1.00E+5nM. Assay description: Polymerase reactions (10 μL) were conducted for 60 minutes at 37° C. Nucleoside triphosphates (NTPs) were present at 100 μM each, with 0.05...
Ligand InfoPC cidPC sid
In DepthDetails US Patent