BDBM263740 6-(3-ethoxy- phenyl)-5-[4- [(3S)-1-(3- fluoropropyl)- pyrrolidin-3- yl]oxy- phenyl]-8,9- dihydro- 7H- benzo[7]- annulen-2-ol5-[4-[(3S)- 1-(3- fluoropropyl)- pyrrolidin-3- yl]oxy- phenyl]-6-[4- (trifluoro- methoxy)- phenyl]-8,9- dihydro- 7H- benzo[7]- annulen-2-ol5-[4-[(3S)- 1-(3- fluoropropyl)- pyrrolidin-3- yl]oxy- phenyl]-6-(4- methoxy- phenyl)-8,9- dihydro- 7H- benzo[7]- annulen-2-ol::US9714221, Example 74
SMILES CCOc1cccc(c1)C1=C(c2ccc(O[C@H]3CCN(CCCF)C3)cc2)c2ccc(O)cc2CCC1
InChI Key InChIKey=ZOVVWRPCDDVIKC-LJAQVGFWSA-N
Data  3 IC50
  Tab Delimited (TSV)   2D SDfile   Computed 3D by Vconf -m prep SDfile
Find this compound or compounds like it in BindingDB:
Activity Spreadsheet -- Enzyme Inhibition Constant Data from BindingDB
Found 3 hits for monomerid = 263740
TargetEstrogen receptor(Homo sapiens (Human))
Sanofi
US Patent
LigandPNGBDBM263740(6-(3-ethoxy- phenyl)-5-[4- [(3S)-1-(3- fluoropropy...)
Affinity DataIC50:  2nMpH: 7.4 T: 2°C. Assay description: It is a competition assay, where binding of a test compound to a complex comprised of (i) His6-ERα298-554 protein representing ERα ligand-b...
Ligand InfoPC cidPC sid
In DepthDetails US Patent
TargetEstrogen receptor [Y537S](Homo sapiens (Human))
Sanofi
US Patent
LigandPNGBDBM263740(6-(3-ethoxy- phenyl)-5-[4- [(3S)-1-(3- fluoropropy...)
Affinity DataIC50:  26nMpH: 7.4 T: 2°C. Assay description: It is a competition assay, where binding of a test compound to a complex comprised of (i) His6-ERα298-554 protein representing ERα ligand-b...
Ligand InfoPC cidPC sid
In DepthDetails US Patent
TargetEstrogen receptor [D538G](Homo sapiens (Human))
Sanofi
US Patent
LigandPNGBDBM263740(6-(3-ethoxy- phenyl)-5-[4- [(3S)-1-(3- fluoropropy...)
Affinity DataIC50:  28nMpH: 7.4 T: 2°C. Assay description: It is a competition assay, where binding of a test compound to a complex comprised of (i) His6-ERα298-554 protein representing ERα ligand-b...
Ligand InfoPC cidPC sid
In DepthDetails US Patent