BDBM264134 4-(3-(3-(4-Fluorophenyl)-2,6-dioxo-2,3-dihydropyrimidin-1(6H)-yl)-2-methylphenyl)-7-(2-hydroxypropan-2-yl)-9H-carbazole-1-carboxamide (Mixture of Four diastereomers)::US9714234, 9
SMILES Cc1c(cccc1-n1c(=O)ccn(-c2ccc(F)cc2)c1=O)-c1ccc(C(N)=O)c2[nH]c3cc(ccc3c12)C(C)(C)O
InChI Key InChIKey=OPCHAIUSSHIEQR-UHFFFAOYSA-N
Data  2 IC50
  Tab Delimited (TSV)   2D SDfile   Computed 3D by Vconf -m prep SDfile
Find this compound or compounds like it in BindingDB:
Activity Spreadsheet -- Enzyme Inhibition Constant Data from BindingDB
Found 2 hits for monomerid = 264134
TargetTyrosine-protein kinase JAK2(Homo sapiens (Human))
Bristol-Myers Squibb
US Patent
LigandPNGBDBM264134(4-(3-(3-(4-Fluorophenyl)-2,6-dioxo-2,3-dihydropyri...)
Affinity DataIC50:  1.00E+3nMpH: 7.4 T: 2°C. Assay description: Compounds with activity against Jak2 tyrosine kinase have been observed to cause thrombocytopenia, anemia and neutropenia in human patients in clinic...
Ligand InfoPC cidPC sid
In DepthDetails US Patent
TargetTyrosine-protein kinase BTK(Homo sapiens (Human))
Bristol-Myers Squibb
US Patent
LigandPNGBDBM264134(4-(3-(3-(4-Fluorophenyl)-2,6-dioxo-2,3-dihydropyri...)
Affinity DataIC50:  2.20nMpH: 7.4 T: 2°C. Assay description: To V-bottom 384-well plates were added test compounds, human recombinant Btk (1 nM, INVITROGEN Corporation), fluoresceinated peptide (1.5 μM), A...
Ligand InfoPC cidPC sid
In DepthDetails US Patent